Home > Cannot Execute > Scripts/mod/modpost Cannot Execute Binary File

Scripts/mod/modpost Cannot Execute Binary File

Contents

ls -la /path/to/testscript Report this message #5: Re: Shell - cannot execute binary file Posted on 2005-11-23 09:58:03 by Thorsten Kampe * tester (2005-11-22 23:56 +0100) >> I'm guessing it works How do I avoid referring to all state variables when updating only a few? Have to install the cross compiler and export i.e. Then you should add the path in the PATH environment variable, then you can use arm-linux-gcc comment directly . http://stevemattley.com/cannot-execute/scp-cannot-execute-binary-file.html

Related 20Cross compiling a kernel module3Cross compiling a kernel module: invalid module format1Cross-compile Linux kernel with additional modules4Cross Compile Linux Kernel Module0Cross-compiling kernel module for ARM0Cross compiling a kernel module ARM1Must linux shell share|improve this question edited Apr 9 '10 at 23:32 Dennis Williamson 171k43246311 asked Mar 28 '10 at 18:46 Maksim Skurydzin 5,79632743 "sed" isn't a shell script, so If you can read Chinese, you can read my experience here. Ashish Vishwakarma 2012-08-08 08:35:02 Thanks to davef, according to your suggestion able to compile kernel.. http://www.openstora.com/forum/viewtopic.php?f=16&t=406&start=15

Cannot Execute Binary File Linux

athctrl.c gcc -o athdebug -g -O2 -Wall -I. -I../hal -I.. Suggests to me that a file that declares this value has not been included. Did any one got the solutions .This is the Error log i get ==>LTIB> make V=1 ARCH=ppcmake -C ../linux-2.6.23 M=/home/Admin/Document/MPC8641d/Install/ltib-mpc8641hpcn-20080117/rpm/BUILD/testmake[1]: Entering directory `/home/Admin/Document/MPC8641d/Install/ltib-mpc8641hpcn-20080117/rpm/BUILD/linux-2.6.23'test -e include/linux/autoconf.h -a -e include/config/auto.conf || ( Not the answer you're looking for?

it's ia32-libs! # issue first the command above, then execute this one: sudo apt-get install ia32-libs mark 2014-10-09 12:03:47 OS is ubuntu13.10 , 32bit , AMD E-450 APU with Radeon(tm) HD You can just run it as [email protected]:~$ sed share|improve this answer answered Mar 28 '10 at 18:48 nos 142k33240377 add a comment| up vote 0 down vote sh is expecting a thanks... Cannot Execute Binary File Java mark 2014-10-13 08:27:22 Sandeep Sondagar, change to root and it works!

Browse other questions tagged linux shell or ask your own question. ath_hal: 0.9.18.0 (AR5210, AR5211, AR5212, RF5111, RF5112, RF2413, RF5413, REGO) wlan: 0.8.4.2 (0.9.3.1) ath_pci: 0.9.4.5 (0.9.3.1) ath_rate_sample: 1.2 (0.9.3.1) wifi0: 11a rates: 6Mbps 9Mbps 12Mbps 18Mbps 24Mbps 36Mbps 48Mbps 54Mbps wifi0: more stack exchange communities company blog Stack Exchange Inbox Reputation and Badges sign up log in tour help Tour Start here for a quick overview of the site Help Center Detailed news Report this message #4: Re: Shell - cannot execute binary file Posted on 2005-11-23 04:10:33 by harryooopotter tester wrote... > >Hi, >I am trying to run simple PATH or echo command

Start a coup online without the government intervening Polyglot Anagrams Robbers' Thread What legal documents are Italian citizens supposed to carry when traveling to Ireland? Bash Cannot Execute Binary File Exec Format Error I was able to build userspace program for the board o n the board. jack 2013-06-27 15:31:43 Hi davef , i am trying to install the android for mini2440 i am getting the follwing error [email protected]:~/usr/local/android/kernel$ make zImage make: arm-linux-gcc: Command not found CHK include/linux/version.h This trick fails since Linux 2.4.25 / 2.6.0.) Problem solved by remounting the partition with /etc/fstab: [email protected]:~$ cat /etc/fstab | grep sda8 /dev/sda8 /home ext3 users,exec,dev,suid 0 2 Quick Navigation Programming

Cannot Execute Binary File Exec Format Error Ubuntu

Done Building dependency tree Reading state information... I suppose a better starting point would be, what is the output of echo $PATH ? (edit: the export command is a way to define an environment variable in bash.) –Darth Cannot Execute Binary File Linux Commands such as halt, poweroff, reboot will return command not found. Cannot Execute Binary File Bash This tool uses JavaScript and much of it will not work correctly without it enabled.

You can use objdump (from binutils) to check architecture of binaries. http://stevemattley.com/cannot-execute/sh-bin-grep-cannot-execute-binary-file.html CC kernel/bounds.s /bin/sh: 1: arm-linux-gcc: not found make[1]: *** [kernel/bounds.s] Error 127 make: *** [prepare0] Error 2 When I execute same command with super user, I get different error as below [email protected]:~$ sh sed /bin/sed: /bin/sed: cannot execute binary file When I first launch sh and try to execute sed, it succeeds. is there a script in the build folder to do this? Cannot Execute Binary File Mac

WaRP 7 Read More NEWS   10 Nov 2015 7 playful uses for NFC in gaming Read More NEWS   6 Nov 2015 Meet an NFC innovator: Speech Code Read More NEWS   5 but : [email protected]:~/fA_new/mini2440/linux-2.6.32.2$ sudo apt-get install gcc-arm-linux-gnueabi lib32ncurses5 lib32stdc++6 lib32z1 lib32bz2-1.0 Reading package lists... CHK include/linux/utsrelease.h SYMLINK include/asm -> include/asm-arm CC kernel/bounds.s /bin/sh: 1: arm-linux-gcc: not found make[1]: *** [kernel/bounds.s] Error 127 make: *** [prepare0] Error 2 [email protected]:~/fA_new/mini2440/linux-2.6.32.2$ //---------------------------------------------------------------- Can anyone help? http://stevemattley.com/cannot-execute/sh-usr-bin-gcc-cannot-execute-binary-file.html COLLECT_GCC=arm-linux-gcc COLLECT_LTO_WRAPPER=/opt/FriendlyARM/toolschain/4.5.1/libexec/gcc/arm-none-linux -gnueabi/4.5.1/lto-wrapper Target: arm-none-linux-gnueabi Configured with: /work/toolchain/build/src/gcc-4.5.1/configure --build=i686-build_pc-linux-gnu --host=i686-build_pc-linux-gnu --target=arm-none-linux-gnueabi --prefix=/opt/FriendlyARM/toolschain/4.5.1 --with-sysroot=/opt/FriendlyARM/toolschain/4.5.1/arm-none-linux-gnueabi/sys-root --enable-languages=c,c++ --disable-multilib --with-cpu=arm1176jzf-s --with-tune=arm1176jzf-s --with-fpu=vfp --with-float=softfp --with-pkgversion=ctng-1.8.1-FA --with-bugurl=http://www.arm9.net/ --disable-sjlj-exceptions --enable-__cxa_atexit --disable-libmudflap --with-host-libstdcxx='-static-libgcc -Wl,-Bstatic,-lstdc++,-Bdynamic -lm' --with-gmp=/work/toolchain/build/arm-none-linux-gnueabi/build/static --with-mpfr=/work/toolchain/build/arm-none-linux-gnueabi/build/static --with-ppl=/work/toolchain/build/arm-none-linux-gnueabi/build/static --with-cloog=/work/toolchain/build/arm-none-linux-gnueabi/build/static

You are at Ubuntu version 12.04 or lower # issue first the command above, then execute this one: sudo apt-get install is32-bits 2. Cannot Execute Binary File Ubuntu That way I was able to specify the kernel headers build directory for cross compiling the kernel module and it worked. Also make sure you have: Code: #!/bin/bash at the beginnig 01-22-2008 #3 valan View Profile View Forum Posts Private Message View Articles Linux Engineer Join Date Nov 2004 Location home Posts

Read More NEWS   12 Nov 2015 The accidental thermal engineer: Can we know Tj by looking at Tcase?

C# TBB updating metadata value Isn't AES-NI useless because now the key length need to be longer? Possible repercussions from assault between coworkers outside the office Why are wavelengths shorter than visible light neglected by new telescopes? Not the answer you're looking for? Cannot Execute Binary File Exec Format Error Cygwin I'm starting to lose my wits.

share|improve this answer answered Mar 28 '10 at 18:48 Brian Agnew 189k22235340 add a comment| Your Answer draft saved draft discarded Sign up or log in Sign up using Google davef 2013-06-28 09:37:59 Unless you have the export path in .bashrc or .profile jack 2013-06-28 15:33:10 Hi, I am keeping it in home/rnd/opt/FriendlyARM/toolschain/4.5.1/bin [email protected]:/home/rnd/opt/FriendlyARM/toolschain/4.5.1/bin# export PATH=/opt/FriendlyARM/toolschain/4.5.1/bin:$PATH [email protected]:/home/rnd/opt/FriendlyARM/toolschain/4.5.1/bin# arm-linux-gcc v arm-linux-gcc: command Once all these procedure are followed you will be successfully compiling your kernel module for target. this content Find the "unwrapped size" of a list Zener diodes in glass axial package - not inherently shielded from photoelectric effect?

To see exactly what you have in the file, use od: od -c testscript -- Chris F.A. asked 6 years ago viewed 5935 times active 3 years ago Upcoming Events 2016 Community Moderator Election ends Nov 22 Get the weekly newsletter! What do I do? If you don't want to actually change those files, you can of cause use aufs / overlayfs / bind mount to achieve the same.

Why were pre-election polls and forecast models so wrong about Donald Trump?